• Chatbox

    You don't have permission to chat.
    Load More
  • 0
Marcos Pinheiro

Erro ao finalizar a compilação do game

Question

Boas, o game compila até o fim, porém na hora de finalzar aparece o seguinte erro:

 

/usr/local/bin/ld: cannot find -lsql

collect2: error: ld returned 1 exit status

gmake: *** [Makefile:194: ../game_r41023] Error 1

 

Alguém poderia me ajudar? estou a procurar na internet mais não encontro nada sobre esse erro.

Share this post


Link to post
Share on other sites

3 answers to this question

  • 0
Em 05/06/2021 em 19:23, Marcos Pinheiro disse:

Boas, o game compila até o fim, porém na hora de finalzar aparece o seguinte erro:

 

/usr/local/bin/ld: cannot find -lsql

collect2: error: ld returned 1 exit status

gmake: *** [Makefile:194: ../game_r41023] Error 1

 

Alguém poderia me ajudar? estou a procurar na internet mais não encontro nada sobre esse erro.

 

Entra na pasta "  sql/src " e faça gmake

 

vai resolver esse erro.

Share this post


Link to post
Share on other sites

Create an account or sign in to comment

You need to be a member in order to leave a comment

Create an account

Sign up for a new account in our community. It's easy!

Register a new account

Sign in

Already have an account? Sign in here.

Sign In Now